Reaction Details
TargetEnvelope glycoprotein gp160
LigandBDBM30906
Substrate/Competitorn/a
IC50 19152±n/a nM
Citation PubChem, PC Counterscreen for discovery of small molecules that bind to the HIV-1-gp120 binding antibody, PG9 PubChem Bioassay(2012)[AID]
 
Envelope glycoprotein gp160
Name:Envelope glycoprotein gp160
Type:n/a
Mol. Mass.:97241.93
Organism:Human immunodeficiency virus type 1 group M subtype B (isolate HXB2)
Description:n/a
Residue:856
BDBM30906
NameBDBM30906
Synonyms:2-(5-hydroxy-2-keto-4,7-dimethyl-chromen-3-yl)acetic acid methyl ester MLS000065141 cid_5428525 methyl 2-(4,7-dimethyl-5-oxidanyl-2-oxidanylidene-chromen-3-yl)ethanoate | methyl 2-(5-hydroxy-4,7-dimethyl-2-oxochromen-3-yl)acetate
TypeSmall organic molecule
Emp. Form.C14H14O5
Mol. Mass.262.258
SMILESCOC(=O)Cc1c(C)c2c(O)cc(C)cc2oc1=O