Reaction Details
TargetEnvelope glycoprotein gp160
LigandBDBM95257
Substrate/Competitorn/a
IC50 13370±n/a nM
Citation PubChem, PC Counterscreen for discovery of small molecules that bind to the HIV-1-gp120 binding antibody, PG9 PubChem Bioassay(2012)[AID]
 
Envelope glycoprotein gp160
Name:Envelope glycoprotein gp160
Type:n/a
Mol. Mass.:97241.93
Organism:Human immunodeficiency virus type 1 group M subtype B (isolate HXB2)
Description:n/a
Residue:856
BDBM95257
NameBDBM95257
Synonyms:MLS000566665 N-[5-(benzylthio)-1,3,4-thiadiazol-2-yl]-4,5,6,7-tetrahydrobenzothiophene-2-carboxamide N-[5-(phenylmethylthio)-1,3,4-thiadiazol-2-yl]-4,5,6,7-tetrahydro-1-benzothiophene-2-carboxamide cid_2558414
TypeSmall organic molecule
Emp. Form.C18H17N3OS3
Mol. Mass.387.542
SMILESO=C(Nc1nnc(SCc2ccccc2)s1)c1cc2CCCCc2s1