Reaction Details
TargetEnvelope glycoprotein gp160
LigandBDBM95278
Substrate/Competitorn/a
IC50 29146±n/a nM
Citation PubChem, PC Counterscreen for discovery of small molecules that bind to the HIV-1-gp120 binding antibody, PG9 PubChem Bioassay(2012)[AID]
 
Envelope glycoprotein gp160
Name:Envelope glycoprotein gp160
Type:n/a
Mol. Mass.:97241.93
Organism:Human immunodeficiency virus type 1 group M subtype B (isolate HXB2)
Description:n/a
Residue:856
BDBM95278
NameBDBM95278
Synonyms:5H-pyrrolo[1,2-a]quinoxaline-4-thione SMR000528808 | cid_4677074
TypeSmall organic molecule
Emp. Form.C11H8N2S
Mol. Mass.200.26
SMILESS=c1[nH]c2ccccc2n2cccc12