Reaction Details
TargetEnvelope glycoprotein gp160
LigandBDBM95295
Substrate/Competitorn/a
IC50 7817±n/a nM
Citation PubChem, PC Counterscreen for discovery of small molecules that bind to the HIV-1-gp120 binding antibody, PG9 PubChem Bioassay(2012)[AID]
 
Envelope glycoprotein gp160
Name:Envelope glycoprotein gp160
Type:n/a
Mol. Mass.:97241.93
Organism:Human immunodeficiency virus type 1 group M subtype B (isolate HXB2)
Description:n/a
Residue:856
BDBM95295
NameBDBM95295
Synonyms:(4E)-4-[2,3-dihydro-1,4-benzodioxin-6-yl(hydroxy)methylene]-5-(2-fluorophenyl)-1-(4-pyridylmethyl)pyrrolidine-2,3-quinone (4E)-4-[2,3-dihydro-1,4-benzodioxin-6-yl(oxidanyl)methylidene]-5-(2-fluorophenyl)-1-(pyridin-4-ylmethyl)pyrrolidine-2,3-dione SMR000650337 | cid_5809890
TypeSmall organic molecule
Emp. Form.C25H19FN2O5
Mol. Mass.446.4272
SMILESFc1ccccc1C1C(C(=O)c2ccc3OCCOc3c2)C(=O)C(=O)N1Cc1ccncc1