Reaction Details
TargetMitochondrial peptide methionine sulfoxide reductase
LigandBDBM95355
Substrate/Competitorn/a
IC50 113542±n/a nM
Citation PubChem, PC Absorbance-based biochemical high throughput dose response assay to identify inhibitors of Methionine sulfoxide reductase A (MsrA) PubChem Bioassay(2013)[AID]
 
Mitochondrial peptide methionine sulfoxide reductase
Name:Mitochondrial peptide methionine sulfoxide reductase
Type:Enzyme Catalytic Domain
Mol. Mass.:25822.90
Organism:Bos taurus
Description:gi_73586699
Residue:233
BDBM95355
NameBDBM95355
Synonyms:4-((E)-{[(4-{[(2E)-2-(4-carboxybenzylidene)hydrazino]carbonyl}-3,5-dimethyl-1H-pyrrol-2-yl)carbonyl]hydrazono}methyl)benzoic acid 4-[(E)-[[5-[[(E)-(4-carboxyphenyl)methylideneamino]carbamoyl]-2,4-dimethyl-1H-pyrrol-3-yl]carbonylhydrazinylidene]methyl]benzoic acid 4-[(E)-[[[5-[[(2E)-2-[(4-carboxyphenyl)methylidene]hydrazinyl]-oxomethyl]-2,4-dimethyl-1H-pyrrol-3-yl]-oxomethyl]hydrazinylidene]methyl]benzoic acid SMR000207632 | cid_20846810
TypeSmall organic molecule
Emp. Form.C24H21N5O6
Mol. Mass.475.4534
SMILESCc1[nH]c(C(=O)N\N=C\c2ccc(cc2)C(O)=O)c(C)c1C(=O)N\N=C\c1ccc(cc1)C(O)=O