Reaction Details
TargetMitochondrial peptide methionine sulfoxide reductase
LigandBDBM95371
Substrate/Competitorn/a
IC50 97459±n/a nM
Citation PubChem, PC Absorbance-based biochemical high throughput dose response assay to identify inhibitors of Methionine sulfoxide reductase A (MsrA) PubChem Bioassay(2013)[AID]
 
Mitochondrial peptide methionine sulfoxide reductase
Name:Mitochondrial peptide methionine sulfoxide reductase
Type:Enzyme Catalytic Domain
Mol. Mass.:25822.90
Organism:Bos taurus
Description:gi_73586699
Residue:233
BDBM95371
NameBDBM95371
Synonyms:(4-Oxo-2-{[(E)-3-phenyl-prop-2-en-(E)-ylidene]-hydrazono}-thiazolidin-5-yl)-acetic acid 2-[4-oxidanylidene-2-[(2E)-2-[(E)-3-phenylprop-2-enylidene]hydrazinyl]-1,3-thiazol-5-yl]ethanoic acid 2-[4-oxo-2-[(2E)-2-[(E)-3-phenylprop-2-enylidene]hydrazinyl]-5-thiazolyl]acetic acid SMR000219756 | cid_16428363
TypeSmall organic molecule
Emp. Form.C14H13N3O3S
Mol. Mass.303.336
SMILESOC(=O)Cc1sc(N=NC=CCc2ccccc2)nc1O