Reaction Details
TargetMitochondrial peptide methionine sulfoxide reductase
LigandBDBM95372
Substrate/Competitorn/a
IC50 118309±n/a nM
Citation PubChem, PC Absorbance-based biochemical high throughput dose response assay to identify inhibitors of Methionine sulfoxide reductase A (MsrA) PubChem Bioassay(2013)[AID]
 
Mitochondrial peptide methionine sulfoxide reductase
Name:Mitochondrial peptide methionine sulfoxide reductase
Type:Enzyme Catalytic Domain
Mol. Mass.:25822.90
Organism:Bos taurus
Description:gi_73586699
Residue:233
BDBM95372
NameBDBM95372
Synonyms:MLS000722032 cid_16428461 sodium;2-[4-oxidanylidene-2-[(2E)-2-[(E)-3-phenylprop-2-enylidene]hydrazinyl]-1,3-thiazol-5-yl]ethanoate sodium;2-[4-oxo-2-[(2E)-2-[(E)-3-phenylprop-2-enylidene]hydrazinyl]-5-thiazolyl]acetate
TypeSmall organic molecule
Emp. Form.C14H12N3O3S
Mol. Mass.302.329
SMILESOc1nc(N=NC=CCc2ccccc2)sc1CC([O-])=O