Reaction Details
TargetMitochondrial peptide methionine sulfoxide reductase
LigandBDBM95396
Substrate/Competitorn/a
IC50 133641±n/a nM
Citation PubChem, PC Absorbance-based biochemical high throughput dose response assay to identify inhibitors of Methionine sulfoxide reductase A (MsrA) PubChem Bioassay(2013)[AID]
 
Mitochondrial peptide methionine sulfoxide reductase
Name:Mitochondrial peptide methionine sulfoxide reductase
Type:Enzyme Catalytic Domain
Mol. Mass.:25822.90
Organism:Bos taurus
Description:gi_73586699
Residue:233
BDBM95396
NameBDBM95396
Synonyms:5-methyl-N-[(E)-[(E)-3-phenylprop-2-enylidene]amino]-2-furamide 5-methyl-N-[(E)-[(E)-3-phenylprop-2-enylidene]amino]furan-2-carboxamide SMR000287179 | cid_9591267
TypeSmall organic molecule
Emp. Form.C15H14N2O2
Mol. Mass.254.2839
SMILESCc1ccc(o1)C(=O)N\N=C\C=C\c1ccccc1