Reaction Details
TargetMitochondrial peptide methionine sulfoxide reductase
LigandBDBM95399
Substrate/Competitorn/a
IC50 53600±n/a nM
Citation PubChem, PC Absorbance-based biochemical high throughput dose response assay to identify inhibitors of Methionine sulfoxide reductase A (MsrA) PubChem Bioassay(2013)[AID]
 
Mitochondrial peptide methionine sulfoxide reductase
Name:Mitochondrial peptide methionine sulfoxide reductase
Type:Enzyme Catalytic Domain
Mol. Mass.:25822.90
Organism:Bos taurus
Description:gi_73586699
Residue:233
BDBM95399
NameBDBM95399
Synonyms:1'H-spiro[cyclopentane-1,2'-quinazoline]-4'(3'H)-thione MLS000730176 cid_686361 | spiro[1,3-dihydroquinazoline-2,1'-cyclopentane]-4-thione
TypeSmall organic molecule
Emp. Form.C12H14N2S
Mol. Mass.218.318
SMILESS=C1NC2(CCCC2)Nc2ccccc12