Reaction Details
TargetMitochondrial peptide methionine sulfoxide reductase
LigandBDBM71178
Substrate/Competitorn/a
IC50 11586±n/a nM
Citation PubChem, PC Absorbance-based biochemical high throughput dose response assay to identify inhibitors of Methionine sulfoxide reductase A (MsrA) PubChem Bioassay(2013)[AID]
 
Mitochondrial peptide methionine sulfoxide reductase
Name:Mitochondrial peptide methionine sulfoxide reductase
Type:Enzyme Catalytic Domain
Mol. Mass.:25822.90
Organism:Bos taurus
Description:gi_73586699
Residue:233
BDBM71178
NameBDBM71178
Synonyms:4-(3-Benzotriazol-1-yl-1,4-dioxo-1,4-dihydro-naphthalen-2-ylamino)-benzoic acid 4-[[3-(benzotriazol-1-yl)-1,4-bis(oxidanylidene)naphthalen-2-yl]amino]benzoic acid 4-[[3-(benzotriazol-1-yl)-1,4-dioxonaphthalen-2-yl]amino]benzoic acid SMR000415241 | cid_1397082
TypeSmall organic molecule
Emp. Form.C23H14N4O4
Mol. Mass.410.3817
SMILESOC(=O)c1ccc(NC2=C(C(=O)c3ccccc3C2=O)n2nnc3ccccc23)cc1