Reaction Details
TargetMitochondrial peptide methionine sulfoxide reductase
LigandBDBM51902
Substrate/Competitorn/a
IC50 12793±n/a nM
Citation PubChem, PC Absorbance-based biochemical high throughput dose response assay to identify inhibitors of Methionine sulfoxide reductase A (MsrA) PubChem Bioassay(2013)[AID]
 
Mitochondrial peptide methionine sulfoxide reductase
Name:Mitochondrial peptide methionine sulfoxide reductase
Type:Enzyme Catalytic Domain
Mol. Mass.:25822.90
Organism:Bos taurus
Description:gi_73586699
Residue:233
BDBM51902
NameBDBM51902
Synonyms:MLS001203758 N-[(4-fluorophenyl)methylideneamino]-6-methoxy-2-methyl-4-quinolinamine N-[(4-fluorophenyl)methylideneamino]-6-methoxy-2-methylquinolin-4-amine [(4-fluorobenzylidene)amino]-(6-methoxy-2-methyl-4-quinolyl)amine cid_3141521
TypeSmall organic molecule
Emp. Form.C18H16FN3O
Mol. Mass.309.3375
SMILESCOc1ccc2nc(C)cc(N=NCc3ccc(F)cc3)c2c1