Reaction Details
TargetMitochondrial peptide methionine sulfoxide reductase
LigandBDBM95445
Substrate/Competitorn/a
IC50 118941±n/a nM
Citation PubChem, PC Absorbance-based biochemical high throughput dose response assay to identify inhibitors of Methionine sulfoxide reductase A (MsrA) PubChem Bioassay(2013)[AID]
 
Mitochondrial peptide methionine sulfoxide reductase
Name:Mitochondrial peptide methionine sulfoxide reductase
Type:Enzyme Catalytic Domain
Mol. Mass.:25822.90
Organism:Bos taurus
Description:gi_73586699
Residue:233
BDBM95445
NameBDBM95445
Synonyms:3-[2,4-dinitro-5-(1-piperidinylamino)phenoxy]-2-ethyl-4-pyranone 3-[2,4-dinitro-5-(piperidin-1-ylamino)phenoxy]-2-ethylpyran-4-one MLS000949960 cid_24792202
TypeSmall organic molecule
Emp. Form.C18H20N4O7
Mol. Mass.404.374
SMILESCCc1occc(=O)c1Oc1cc(NN2CCCCC2)c(cc1[N+]([O-])=O)[N+]([O-])=O