Reaction Details
TargetMitochondrial peptide methionine sulfoxide reductase
LigandBDBM48035
Substrate/Competitorn/a
IC50 4995±n/a nM
Citation PubChem, PC Absorbance-based biochemical high throughput dose response assay to identify inhibitors of Methionine sulfoxide reductase A (MsrA) PubChem Bioassay(2013)[AID]
 
Mitochondrial peptide methionine sulfoxide reductase
Name:Mitochondrial peptide methionine sulfoxide reductase
Type:Enzyme Catalytic Domain
Mol. Mass.:25822.90
Organism:Bos taurus
Description:gi_73586699
Residue:233
BDBM48035
NameBDBM48035
Synonyms:4-[[(4E)-4-(4-ethylphenyl)sulfonylimino-1-keto-2-naphthyl]amino]benzoic acid 4-[[(4E)-4-(4-ethylphenyl)sulfonylimino-1-oxo-2-naphthalenyl]amino]benzoic acid MLS000948041 cid_5824720
TypeSmall organic molecule
Emp. Form.C25H20N2O5S
Mol. Mass.460.502
SMILESCCc1ccc(cc1)S(=O)(=O)N=C1C=C(Nc2ccc(cc2)C(O)=O)C(=O)c2ccccc12