Reaction Details
TargetMitochondrial peptide methionine sulfoxide reductase
LigandBDBM48038
Substrate/Competitorn/a
IC50 62405±n/a nM
Citation PubChem, PC Absorbance-based biochemical high throughput dose response assay to identify inhibitors of Methionine sulfoxide reductase A (MsrA) PubChem Bioassay(2013)[AID]
 
Mitochondrial peptide methionine sulfoxide reductase
Name:Mitochondrial peptide methionine sulfoxide reductase
Type:Enzyme Catalytic Domain
Mol. Mass.:25822.90
Organism:Bos taurus
Description:gi_73586699
Residue:233
BDBM48038
NameBDBM48038
Synonyms:4-[(E)-[3-(2-methylanilino)-4-oxo-1-naphthalenylidene]amino]sulfonylbenzoic acid 4-[(E)-[3-[(2-methylphenyl)amino]-4-oxidanylidene-naphthalen-1-ylidene]amino]sulfonylbenzoic acid MLS000948152 cid_6023693
TypeSmall organic molecule
Emp. Form.C24H18N2O5S
Mol. Mass.446.475
SMILESCc1ccccc1NC1=CC(=NS(=O)(=O)c2ccc(cc2)C(O)=O)c2ccccc2C1=O