Reaction Details
TargetMitochondrial peptide methionine sulfoxide reductase
LigandBDBM95459
Substrate/Competitorn/a
IC50 112331±n/a nM
Citation PubChem, PC Absorbance-based biochemical high throughput dose response assay to identify inhibitors of Methionine sulfoxide reductase A (MsrA) PubChem Bioassay(2013)[AID]
 
Mitochondrial peptide methionine sulfoxide reductase
Name:Mitochondrial peptide methionine sulfoxide reductase
Type:Enzyme Catalytic Domain
Mol. Mass.:25822.90
Organism:Bos taurus
Description:gi_73586699
Residue:233
BDBM95459
NameBDBM95459
Synonyms:1,2-bis(3,4-dihydroxyphenyl)ethane-1,2-dione MLS002608408 cid_238232
TypeSmall organic molecule
Emp. Form.C14H10O6
Mol. Mass.274.2256
SMILESOc1ccc(cc1O)C(=O)C(=O)c1ccc(O)c(O)c1