Reaction Details
TargetNuclear receptor subfamily 5 group A member 2
LigandBDBM95519
Substrate/Competitorn/a
IC50>3986±n/a nM
Citation PubChem, PC Luminescence-based cell-based high throughput dose response assay for inverse agonists of the liver receptor homolog-1 (LRH-1; NR5A2) PubChem Bioassay(2013)[AID]
 
Nuclear receptor subfamily 5 group A member 2
Name:Nuclear receptor subfamily 5 group A member 2
Type:Nuclear Hormone Receptor
Mol. Mass.:61341.37
Organism:Homo sapiens (Human)
Description:n/a
Residue:541
BDBM95519
NameBDBM95519
Synonyms:MLS000694878 N-[[(2-fluorobenzyl)oxyamino]methylene]-4-methoxy-2-phenoxy-nicotinamide N-[[(2-fluorophenyl)methoxyamino]methylidene]-4-methoxy-2-phenoxy-pyridine-3-carboxamide SMR000334758 | cid_5191161
TypeSmall organic molecule
Emp. Form.C21H18FN3O4
Mol. Mass.395.3837
SMILESCOc1ccnc(Oc2ccccc2)c1C(=O)NC=NOCc1ccccc1F