Reaction Details
TargetNuclear receptor subfamily 5 group A member 2
LigandBDBM95529
Substrate/Competitorn/a
IC50 1374±n/a nM
Citation PubChem, PC Luminescence-based cell-based high throughput dose response assay for inverse agonists of the liver receptor homolog-1 (LRH-1; NR5A2) PubChem Bioassay(2013)[AID]
 
Nuclear receptor subfamily 5 group A member 2
Name:Nuclear receptor subfamily 5 group A member 2
Type:Nuclear Hormone Receptor
Mol. Mass.:61341.37
Organism:Homo sapiens (Human)
Description:n/a
Residue:541
BDBM95529
NameBDBM95529
Synonyms:MLS001018993 N-(4-methoxyphenyl)-2-(1H-pyrazolo[3,4-d]pyrimidin-4-ylsulfanyl)ethanamide SMR000363374 | cid_2475269
TypeSmall organic molecule
Emp. Form.C14H13N5O2S
Mol. Mass.315.35
SMILESCOc1ccc(NC(=O)CSc2ncnc3n[nH]cc23)cc1