Reaction Details
TargetNuclear receptor subfamily 5 group A member 2
LigandBDBM56817
Substrate/Competitorn/a
IC50>1329±n/a nM
Citation PubChem, PC Luminescence-based cell-based high throughput dose response assay for inverse agonists of the liver receptor homolog-1 (LRH-1; NR5A2) PubChem Bioassay(2013)[AID]
 
Nuclear receptor subfamily 5 group A member 2
Name:Nuclear receptor subfamily 5 group A member 2
Type:Nuclear Hormone Receptor
Mol. Mass.:61341.37
Organism:Homo sapiens (Human)
Description:n/a
Residue:541
BDBM56817
NameBDBM56817
Synonyms:MLS000833680 N-(4-bromo-5-methyl-1,2-oxazol-3-yl)-5-nitrofuran-2-carboxamide N-(4-bromo-5-methyl-isoxazol-3-yl)-5-nitro-2-furamide SMR000457201 | cid_2799295
TypeSmall organic molecule
Emp. Form.C9H6BrN3O5
Mol. Mass.316.065
SMILESCc1onc(NC(=O)c2ccc(o2)[N+]([O-])=O)c1Br