Reaction Details
TargetNuclear receptor subfamily 5 group A member 2
LigandBDBM95565
Substrate/Competitorn/a
IC50>3988±n/a nM
Citation PubChem, PC Luminescence-based cell-based high throughput dose response assay for inverse agonists of the liver receptor homolog-1 (LRH-1; NR5A2) PubChem Bioassay(2013)[AID]
 
Nuclear receptor subfamily 5 group A member 2
Name:Nuclear receptor subfamily 5 group A member 2
Type:Nuclear Hormone Receptor
Mol. Mass.:61341.37
Organism:Homo sapiens (Human)
Description:n/a
Residue:541
BDBM95565
NameBDBM95565
Synonyms:MLS001162031 N-(2,4-difluorophenyl)-2-[(5-phenyl-1H-1,2,4-triazol-3-yl)thio]acetamide SMR000670692 | cid_2667330
TypeSmall organic molecule
Emp. Form.C16H12F2N4OS
Mol. Mass.346.354
SMILESFc1ccc(NC(=O)CSc2nnc([nH]2)-c2ccccc2)c(F)c1