Reaction Details
TargetNuclear receptor subfamily 5 group A member 2
LigandBDBM95586
Substrate/Competitorn/a
IC50>3986±n/a nM
Citation PubChem, PC Luminescence-based cell-based high throughput dose response assay for inverse agonists of the liver receptor homolog-1 (LRH-1; NR5A2) PubChem Bioassay(2013)[AID]
 
Nuclear receptor subfamily 5 group A member 2
Name:Nuclear receptor subfamily 5 group A member 2
Type:Nuclear Hormone Receptor
Mol. Mass.:61341.37
Organism:Homo sapiens (Human)
Description:n/a
Residue:541
BDBM95586
NameBDBM95586
Synonyms:2-(2-keto-7-methyl-4-propyl-chromen-5-yl)oxy-N-(2-pyridyl)acetamide 2-(7-methyl-2-oxo-4-propylchromen-5-yl)oxy-N-pyridin-2-ylacetamide MLS001160382 cid_8034762
TypeSmall organic molecule
Emp. Form.C20H20N2O4
Mol. Mass.352.3838
SMILESCCCc1cc(=O)oc2cc(C)cc(OCC(=O)Nc3ccccn3)c12