Reaction Details
TargetNuclear receptor subfamily 5 group A member 2
LigandBDBM95652
Substrate/Competitorn/a
IC50 4709±n/a nM
Citation PubChem, PC Luminescence-based cell-based high throughput dose response assay for inverse agonists of the liver receptor homolog-1 (LRH-1; NR5A2) PubChem Bioassay(2013)[AID]
 
Nuclear receptor subfamily 5 group A member 2
Name:Nuclear receptor subfamily 5 group A member 2
Type:Nuclear Hormone Receptor
Mol. Mass.:61341.37
Organism:Homo sapiens (Human)
Description:n/a
Residue:541
BDBM95652
NameBDBM95652
Synonyms:(2S)-2-[(3,5-dimethoxybenzoyl)amino]-3-methyl-butyric acid [2-(1,3-benzodioxol-5-ylamino)-2-keto-ethyl] ester MLS002161817 [2-(1,3-benzodioxol-5-ylamino)-2-oxidanylidene-ethyl] (2S)-2-[(3,5-dimethoxyphenyl)carbonylamino]-3-methyl-butanoate cid_16247418
TypeSmall organic molecule
Emp. Form.C23H26N2O8
Mol. Mass.458.4611
SMILESCOc1cc(OC)cc(c1)C(=O)N[C@@H](C(C)C)C(=O)OCC(=O)Nc1ccc2OCOc2c1