Reaction Details
TargetMethionine--tRNA ligase
LigandBDBM71661
Substrate/Competitorn/a
IC50 2048±n/a nM
Citation PubChem, PC Luminescence-based biochemical high throughput dose response assay for inhibitors of Trypanosoma brucei methionyl tRNA synthetase (MetRS) PubChem Bioassay(2013)[AID]
 
Methionine--tRNA ligase
Name:Methionine--tRNA ligase
Synonyms:methionyl-tRNA synthetase
Type:Enzyme Catalytic Domain
Mol. Mass.:86905.45
Organism:Trypanosoma brucei brucei strain 927/4 GUTat10.1
Description:gi_71746704
Residue:773
BDBM71661
NameBDBM71661
TypeSmall organic molecule
Emp. Form.C21H22N4O4
Mol. Mass.394.4238
SMILESCCOC(=O)c1cccc(NC(=O)Cn2c(CC(=O)NC)nc3ccccc23)c1