Reaction Details
TargetMethionine--tRNA ligase
LigandBDBM74708
Substrate/Competitorn/a
IC50 401.41±n/a nM
Citation PubChem, PC Luminescence-based biochemical high throughput dose response assay for inhibitors of Trypanosoma brucei methionyl tRNA synthetase (MetRS) PubChem Bioassay(2013)[AID]
 
Methionine--tRNA ligase
Name:Methionine--tRNA ligase
Synonyms:methionyl-tRNA synthetase
Type:Enzyme Catalytic Domain
Mol. Mass.:86905.45
Organism:Trypanosoma brucei brucei strain 927/4 GUTat10.1
Description:gi_71746704
Residue:773
BDBM74708
NameBDBM74708
TypeSmall organic molecule
Emp. Form.C16H10Cl2N4OS
Mol. Mass.377.248
SMILESClc1ccc(-c2nnc(SCc3nc4ccccc4[nH]3)o2)c(Cl)c1