Reaction Details
TargetMethionine--tRNA ligase
LigandBDBM95779
Substrate/Competitorn/a
IC50 1466±n/a nM
Citation PubChem, PC Luminescence-based biochemical high throughput dose response assay for inhibitors of Trypanosoma brucei methionyl tRNA synthetase (MetRS) PubChem Bioassay(2013)[AID]
 
Methionine--tRNA ligase
Name:Methionine--tRNA ligase
Synonyms:methionyl-tRNA synthetase
Type:Enzyme Catalytic Domain
Mol. Mass.:86905.45
Organism:Trypanosoma brucei brucei strain 927/4 GUTat10.1
Description:gi_71746704
Residue:773
BDBM95779
NameBDBM95779
TypeSmall organic molecule
Emp. Form.C23H25N3O4
Mol. Mass.407.4623
SMILESC[C@H]1C[C@@H](OCc2ccc(CO)cc2)OC(=C1)C(=O)NCc1nc2ccccc2[nH]1