Reaction Details
TargetMethionine--tRNA ligase
LigandBDBM95802
Substrate/Competitorn/a
IC50 1162±n/a nM
Citation PubChem, PC Luminescence-based biochemical high throughput dose response assay for inhibitors of Trypanosoma brucei methionyl tRNA synthetase (MetRS) PubChem Bioassay(2013)[AID]
 
Methionine--tRNA ligase
Name:Methionine--tRNA ligase
Synonyms:methionyl-tRNA synthetase
Type:Enzyme Catalytic Domain
Mol. Mass.:86905.45
Organism:Trypanosoma brucei brucei strain 927/4 GUTat10.1
Description:gi_71746704
Residue:773
BDBM95802
NameBDBM95802
TypeSmall organic molecule
Emp. Form.C15H13F3N2O2
Mol. Mass.310.2711
SMILESCC(=O)c1c[nH]c(c1)C(=O)NCc1cccc(c1)C(F)(F)F