Reaction Details
TargetMethionine--tRNA ligase
LigandBDBM95820
Substrate/Competitorn/a
IC50 720.19±n/a nM
Citation PubChem, PC Luminescence-based biochemical high throughput dose response assay for inhibitors of Trypanosoma brucei methionyl tRNA synthetase (MetRS) PubChem Bioassay(2013)[AID]
 
Methionine--tRNA ligase
Name:Methionine--tRNA ligase
Synonyms:methionyl-tRNA synthetase
Type:Enzyme Catalytic Domain
Mol. Mass.:86905.45
Organism:Trypanosoma brucei brucei strain 927/4 GUTat10.1
Description:gi_71746704
Residue:773
BDBM95820
NameBDBM95820
TypeSmall organic molecule
Emp. Form.C20H19N5O2S
Mol. Mass.393.462
SMILESCOc1ccc(CNC(=O)CSc2nnc3c(n2)[nH]c2ccc(C)cc32)cc1