Reaction Details
TargetMethionine--tRNA ligase
LigandBDBM95825
Substrate/Competitorn/a
IC50 1995±n/a nM
Citation PubChem, PC Luminescence-based biochemical high throughput dose response assay for inhibitors of Trypanosoma brucei methionyl tRNA synthetase (MetRS) PubChem Bioassay(2013)[AID]
 
Methionine--tRNA ligase
Name:Methionine--tRNA ligase
Synonyms:methionyl-tRNA synthetase
Type:Enzyme Catalytic Domain
Mol. Mass.:86905.45
Organism:Trypanosoma brucei brucei strain 927/4 GUTat10.1
Description:gi_71746704
Residue:773
BDBM95825
NameBDBM95825
TypeSmall organic molecule
Emp. Form.C15H13BrN4O2S
Mol. Mass.393.258
SMILESCOc1cccc(NC(=O)CSc2nc3ncc(Br)cc3[nH]2)c1