Reaction Details
TargetMethionine--tRNA ligase
LigandBDBM95856
Substrate/Competitorn/a
IC50 974±n/a nM
Citation PubChem, PC Luminescence-based biochemical high throughput dose response assay for inhibitors of Trypanosoma brucei methionyl tRNA synthetase (MetRS) PubChem Bioassay(2013)[AID]
 
Methionine--tRNA ligase
Name:Methionine--tRNA ligase
Synonyms:methionyl-tRNA synthetase
Type:Enzyme Catalytic Domain
Mol. Mass.:86905.45
Organism:Trypanosoma brucei brucei strain 927/4 GUTat10.1
Description:gi_71746704
Residue:773
BDBM95856
NameBDBM95856
TypeSmall organic molecule
Emp. Form.C25H28ClN3O2
Mol. Mass.437.962
SMILESC[C@H](O)[C@H]1[C@H](C[C@@H]2N(CCc3c2[nH]c2ccccc32)C1=O)N(C)Cc1ccc(Cl)cc1