Reaction Details
TargetMethionine--tRNA ligase
LigandBDBM95868
Substrate/Competitorn/a
IC50 204.75±n/a nM
Citation PubChem, PC Luminescence-based biochemical high throughput dose response assay for inhibitors of Trypanosoma brucei methionyl tRNA synthetase (MetRS) PubChem Bioassay(2013)[AID]
 
Methionine--tRNA ligase
Name:Methionine--tRNA ligase
Synonyms:methionyl-tRNA synthetase
Type:Enzyme Catalytic Domain
Mol. Mass.:86905.45
Organism:Trypanosoma brucei brucei strain 927/4 GUTat10.1
Description:gi_71746704
Residue:773
BDBM95868
NameBDBM95868
TypeSmall organic molecule
Emp. Form.C23H20F3N3O4
Mol. Mass.459.4178
SMILESFC(F)(F)c1cccc(NC(=O)Cn2cc(C(=O)C(=O)N3CCOCC3)c3ccccc23)c1