Reaction Details
TargetTumor necrosis factor receptor superfamily member 10B
LigandBDBM49291
Substrate/Competitorn/a
EC50 9480±n/a nM
Citation PubChem, PC Dose Response confirmation of uHTS hits for a small molecule Caspase-8 TRAIL sensitizers in a luminescence panel assay PubChem Bioassay(2013)[AID]
 
Tumor necrosis factor receptor superfamily member 10B
Name:Tumor necrosis factor receptor superfamily member 10B
Type:Enzyme Catalytic Domain
Mol. Mass.:47869.76
Organism:Homo sapiens (Human)
Description:gi_224494019
Residue:440
BDBM49291
NameBDBM49291
Synonyms:MLS000061602 N-[4-(diethylamino)phenyl]-2-furancarboxamide SMR000069932 | cid_675057
TypeSmall organic molecule
Emp. Form.C15H18N2O2
Mol. Mass.258.3156
SMILESCCN(CC)c1ccc(NC(=O)c2ccco2)cc1