Reaction Details
TargetTumor necrosis factor receptor superfamily member 10B
LigandBDBM47005
Substrate/Competitorn/a
EC50>12500±n/a nM
Citation PubChem, PC Dose Response confirmation of uHTS hits for a small molecule Caspase-8 TRAIL sensitizers in a luminescence panel assay PubChem Bioassay(2013)[AID]
 
Tumor necrosis factor receptor superfamily member 10B
Name:Tumor necrosis factor receptor superfamily member 10B
Type:Enzyme Catalytic Domain
Mol. Mass.:47869.76
Organism:Homo sapiens (Human)
Description:gi_224494019
Residue:440
BDBM47005
NameBDBM47005
Synonyms:MLS000114722 N-(2-fluorophenyl)-2-[(5-phenyl-1,3,4-oxadiazol-2-yl)sulfanyl]ethanamide SMR000092058 | cid_891159
TypeSmall organic molecule
Emp. Form.C16H12FN3O2S
Mol. Mass.329.349
SMILESFc1ccccc1NC(=O)CSc1nnc(o1)-c1ccccc1