Reaction Details
TargetLow molecular weight phosphotyrosine protein phosphatase
LigandBDBM46214
Substrate/Competitorn/a
IC50>80000±n/a nM
Citation PubChem, PC Dose response confirmation of small molecule inhibitors of Low Molecular Weight Protein Tyrosine Phosphatase, LMPTP, in an orthogonal absorbance-based assay PubChem Bioassay(2013)[AID]
 
Low molecular weight phosphotyrosine protein phosphatase
Name:Low molecular weight phosphotyrosine protein phosphatase
Type:n/a
Mol. Mass.:18042.81
Organism:Homo sapiens (Human)
Description:P24666
Residue:158
BDBM46214
NameBDBM46214
Synonyms:2-[4-[[5-(4-chlorophenyl)-6-ethoxycarbonyl-7-methyl-3-oxidanylidene-5H-[1,3]thiazolo[3,2-a]pyrimidin-2-ylidene]methyl]phenoxy]ethanoic acid 2-[4-[[5-(4-chlorophenyl)-6-ethoxycarbonyl-7-methyl-3-oxo-5H-thiazolo[3,2-a]pyrimidin-2-ylidene]methyl]phenoxy]acetic acid MLS-0351016.0001 | cid_2878586
TypeSmall organic molecule
Emp. Form.C25H21ClN2O6S
Mol. Mass.512.962
SMILESCCOC(=O)C1=C(C)N=c2sc(=Cc3ccc(OCC(O)=O)cc3)c(=O)n2C1c1ccc(Cl)cc1