Reaction Details
TargetFructose-bisphosphate aldolase
LigandBDBM96194
Substrate/Competitorn/a
IC50>9988±n/a nM
Citation PubChem, PC Fluorescence-based biochemical high throughput dose response assay for inhibitors of the fructose-bisphosphate aldolase (FBA) of M. tuberculosis PubChem Bioassay(2013)[AID]
 
Fructose-bisphosphate aldolase
Name:Fructose-bisphosphate aldolase
Type:Protein
Mol. Mass.:36539.01
Organism:Mycobacterium tuberculosis (strain H37Rv)
Description:P9WQA3
Residue:344
BDBM96194
NameBDBM96194
Synonyms:5-[(2-carboxyphenyl)sulfamoyl]-2-hydroxy-benzoic acid 5-[(2-carboxyphenyl)sulfamoyl]-2-oxidanyl-benzoic acid SMR000054530 | cid_789790
TypeSmall organic molecule
Emp. Form.C14H11NO7S
Mol. Mass.337.305
SMILESOC(=O)c1ccccc1NS(=O)(=O)c1ccc(O)c(c1)C(O)=O