Reaction Details
TargetRecBCD enzyme subunit RecD
LigandBDBM80999
Substrate/Competitorn/a
IC50 21825±n/a nM
Citation PubChem, PC Absorbance-based bacterial cell-based high throughput dose response assay to identify inhibitors of RecBCD PubChem Bioassay(2013)[AID]
 
RecBCD enzyme subunit RecD
Name:RecBCD enzyme subunit RecD
Type:Enzyme Catalytic Domain
Mol. Mass.:66906.68
Organism:Escherichia coli str. K-12 substr. MG1655
Description:gi_16130723
Residue:608
BDBM80999
NameBDBM80999
Synonyms:2-(phenylmethyl)-1,2-thiazol-3-one 2-Benzyl-isothiazol-3-one 2-benzyl-4-isothiazolin-3-one SMR000012107 | cid_647455
TypeSmall organic molecule
Emp. Form.C10H9NOS
Mol. Mass.191.25
SMILESO=c1ccsn1Cc1ccccc1