Reaction Details
TargetRecBCD enzyme subunit RecD
LigandBDBM72521
Substrate/Competitorn/a
IC50>39505±n/a nM
Citation PubChem, PC Absorbance-based bacterial cell-based high throughput dose response assay to identify inhibitors of RecBCD PubChem Bioassay(2013)[AID]
 
RecBCD enzyme subunit RecD
Name:RecBCD enzyme subunit RecD
Type:Enzyme Catalytic Domain
Mol. Mass.:66906.68
Organism:Escherichia coli str. K-12 substr. MG1655
Description:gi_16130723
Residue:608
BDBM72521
NameBDBM72521
Synonyms:MLS000722938 N-(5-bromo-2-pyridinyl)-5-nitro-2-furancarboxamide N-(5-bromopyridin-2-yl)-5-nitro-2-furamide SMR000304933 | cid_774017
TypeSmall organic molecule
Emp. Form.C10H6BrN3O4
Mol. Mass.312.076
SMILES[O-][N+](=O)c1ccc(o1)C(=O)Nc1ccc(Br)cn1