Reaction Details
TargetRecBCD enzyme subunit RecD
LigandBDBM81387
Substrate/Competitorn/a
IC50>118589±n/a nM
Citation PubChem, PC Absorbance-based bacterial cell-based high throughput dose response assay to identify inhibitors of RecBCD PubChem Bioassay(2013)[AID]
 
RecBCD enzyme subunit RecD
Name:RecBCD enzyme subunit RecD
Type:Enzyme Catalytic Domain
Mol. Mass.:66906.68
Organism:Escherichia coli str. K-12 substr. MG1655
Description:gi_16130723
Residue:608
BDBM81387
NameBDBM81387
Synonyms:Oxyquinoline, D3, #1 | cid_3129250
TypeSmall organic molecule
Emp. Form.C23H26N2O4
Mol. Mass.394.4635
SMILESCCCCC(=O)NC(c1ccc(OC)c(OC)c1)c1ccc2cccnc2c1O