Reaction Details
TargetRecBCD enzyme subunit RecD
LigandBDBM50401346
Substrate/Competitorn/a
IC50 33923±n/a nM
Citation PubChem, PC Absorbance-based bacterial cell-based high throughput dose response assay to identify inhibitors of RecBCD PubChem Bioassay(2013)[AID]
 
RecBCD enzyme subunit RecD
Name:RecBCD enzyme subunit RecD
Type:Enzyme Catalytic Domain
Mol. Mass.:66906.68
Organism:Escherichia coli str. K-12 substr. MG1655
Description:gi_16130723
Residue:608
BDBM50401346
NameBDBM50401346
Synonyms:CHEMBL316589 | cid_93149
TypeSmall organic molecule
Emp. Form.C13H10N2
Mol. Mass.194.2319
SMILESCc1ccnc2c1ccc1cccnc21