Reaction Details
TargetRecBCD enzyme subunit RecD
LigandBDBM80819
Substrate/Competitorn/a
IC50>39500±n/a nM
Citation PubChem, PC Absorbance-based bacterial cell-based high throughput dose response assay to identify inhibitors of RecBCD PubChem Bioassay(2013)[AID]
 
RecBCD enzyme subunit RecD
Name:RecBCD enzyme subunit RecD
Type:Enzyme Catalytic Domain
Mol. Mass.:66906.68
Organism:Escherichia coli str. K-12 substr. MG1655
Description:gi_16130723
Residue:608
BDBM80819
NameBDBM80819
Synonyms:1-(3-methylphenyl)-3-(1-pyridin-2-ylethylideneamino)thiourea 1-(m-tolyl)-3-[1-(2-pyridyl)ethylideneamino]thiourea SMR001565772 | cid_3005040
TypeSmall organic molecule
Emp. Form.C15H16N4S
Mol. Mass.284.379
SMILESCC(=NNC(=S)Nc1cccc(C)c1)c1ccccn1