Reaction Details
TargetRecBCD enzyme subunit RecD
LigandBDBM96297
Substrate/Competitorn/a
IC50 40918±n/a nM
Citation PubChem, PC Absorbance-based bacterial cell-based high throughput dose response assay to identify inhibitors of RecBCD PubChem Bioassay(2013)[AID]
 
RecBCD enzyme subunit RecD
Name:RecBCD enzyme subunit RecD
Type:Enzyme Catalytic Domain
Mol. Mass.:66906.68
Organism:Escherichia coli str. K-12 substr. MG1655
Description:gi_16130723
Residue:608
BDBM96297
NameBDBM96297
Synonyms:3-anilino-8-quinolinol;2,2,2-trifluoroacetic acid 3-phenylazanylquinolin-8-ol;2,2,2-tris(fluoranyl)ethanoic acid SMR001600571 | cid_56643206
TypeSmall organic molecule
Emp. Form.C15H12N2O
Mol. Mass.236.2686
SMILESOc1cccc2cc(Nc3ccccc3)cnc12