Reaction Details
TargetT cell receptor alpha variable 4
LigandBDBM34278
Substrate/Competitorn/a
IC50>94099±n/a nM
Citation PubChem, PC Fluorescence-based biochemical primary high throughput dose response assay to identify inhibitors of T-cell receptor (TCR)-CD3 interaction using a TAMRA-labeled TCR probe PubChem Bioassay(2013)[AID]
 
T cell receptor alpha variable 4
Name:T cell receptor alpha variable 4
Type:Enzyme Catalytic Domain
Mol. Mass.:12216.28
Organism:Homo sapiens (Human)
Description:A0A0B4J268
Residue:109
BDBM34278
NameBDBM34278
Synonyms:1-(3,4-dihydroxyphenyl)-2-[[4-ethyl-5-(2-methoxyphenyl)-1,2,4-triazol-3-yl]sulfanyl]ethanone 1-[3,4-bis(oxidanyl)phenyl]-2-[[4-ethyl-5-(2-methoxyphenyl)-1,2,4-triazol-3-yl]sulfanyl]ethanone SMR000038049 | cid_665183
TypeSmall organic molecule
Emp. Form.C19H19N3O4S
Mol. Mass.385.437
SMILESCCn1c(SCC(=O)c2ccc(O)c(O)c2)nnc1-c1ccccc1OC