Reaction Details
TargetAlbumin
LigandBDBM34702
Substrate/Competitorn/a
IC50>94106±n/a nM
Citation PubChem, PC Counterscreen for inhibitors of T-cell receptor (TCR)-CD3 interaction: Fluorescence-based biochemical high throughput dose response assay to identify inhibitors of T-cell receptor (TCR)-CD3 interaction using a TAMRA-labeled BSA probe PubChem Bioassay(2013)[AID]
 
Albumin
Name:Albumin
Type:PROTEIN
Mol. Mass.:69288.15
Organism:Bos taurus
Description:ChEMBL_1502598
Residue:607
BDBM34702
NameBDBM34702
Synonyms:(4E)-2,3-dihydroxy-4-[[(4-methyl-2-methylimino-1,3-thiazol-3-yl)amino]methylidene]cyclohexa-2,5-dien-1-one (4E)-2,3-dihydroxy-4-[[(4-methyl-2-methylimino-4-thiazolin-3-yl)amino]methylene]cyclohexa-2,5-dien-1-one (4Z)-2,3-dihydroxy-4-[[(4-methyl-2-methylimino-4-thiazolin-3-yl)amino]methylene]cyclohexa-2,5-dien-1-one SMR000151701 | cid_5834362
TypeSmall organic molecule
Emp. Form.C12H13N3O3S
Mol. Mass.279.315
SMILESCN=c1scc(C)n1N=Cc1ccc(O)c(O)c1O