Reaction Details
TargetAlbumin
LigandBDBM96345
Substrate/Competitorn/a
IC50>93986±n/a nM
Citation PubChem, PC Counterscreen for inhibitors of T-cell receptor (TCR)-CD3 interaction: Fluorescence-based biochemical high throughput dose response assay to identify inhibitors of T-cell receptor (TCR)-CD3 interaction using a TAMRA-labeled BSA probe PubChem Bioassay(2013)[AID]
 
Albumin
Name:Albumin
Type:PROTEIN
Mol. Mass.:69288.15
Organism:Bos taurus
Description:ChEMBL_1502598
Residue:607
BDBM96345
NameBDBM96345
Synonyms:2-hydroxy-3,5,7-trimethylol-cyclohepta-2,4,6-trien-1-one 2-hydroxy-3,5,7-tris(hydroxymethyl)cyclohepta-2,4,6-trien-1-one MLS000766751 cid_741311
TypeSmall organic molecule
Emp. Form.C10H12O5
Mol. Mass.212.1993
SMILESOCc1cc(CO)c(O)c(=O)c(CO)c1