Reaction Details
TargetAlbumin
LigandBDBM51295
Substrate/Competitorn/a
IC50 25557±n/a nM
Citation PubChem, PC Counterscreen for inhibitors of T-cell receptor (TCR)-CD3 interaction: Fluorescence-based biochemical high throughput dose response assay to identify inhibitors of T-cell receptor (TCR)-CD3 interaction using a TAMRA-labeled BSA probe PubChem Bioassay(2013)[AID]
 
Albumin
Name:Albumin
Type:PROTEIN
Mol. Mass.:69288.15
Organism:Bos taurus
Description:ChEMBL_1502598
Residue:607
BDBM51295
NameBDBM51295
Synonyms:8-Amino-2-thioxo-2,3-dihydro-1H-benzo[g]pteridin-4-one 8-amino-2-thioxo-1H-benzo[g]pteridin-4-one MLS000776691 cid_5417965
TypeSmall organic molecule
Emp. Form.C10H7N5OS
Mol. Mass.245.26
SMILESNc1ccc2nc3c(nc2c1)[nH]c(=S)[nH]c3=O