Reaction Details
TargetHuntingtin
LigandBDBM96419
Substrate/Competitorn/a
IC50 796.1±n/a nM
Citation PubChem, PC Fluorescence-based biochemical high throughput dose response assay to identify molecules that bind r(CAG) RNA repeats PubChem Bioassay(2013)[AID]
 
Huntingtin
Name:Huntingtin
Type:PROTEIN
Mol. Mass.:347579.69
Organism:Homo sapiens (Human)
Description:EBI_101216
Residue:3142
BDBM96419
NameBDBM96419
Synonyms:6-chloranyl-N-[2-(2-chlorophenyl)ethyl]-5-methyl-7-oxidanylidene-1H-pyrazolo[1,5-a]pyrimidine-3-carboxamide 6-chloro-N-[2-(2-chlorophenyl)ethyl]-7-keto-5-methyl-1H-pyrazolo[1,5-a]pyrimidine-3-carboxamide SMR000132466 | cid_5130856
TypeSmall organic molecule
Emp. Form.C16H14Cl2N4O2
Mol. Mass.365.214
SMILESCc1nc2c(c[nH]n2c(=O)c1Cl)C(=O)NCCc1ccccc1Cl