Reaction Details
TargetHuntingtin
LigandBDBM53765
Substrate/Competitorn/a
IC50 1535±n/a nM
Citation PubChem, PC Fluorescence-based biochemical high throughput dose response assay to identify molecules that bind r(CAG) RNA repeats PubChem Bioassay(2013)[AID]
 
Huntingtin
Name:Huntingtin
Type:PROTEIN
Mol. Mass.:347579.69
Organism:Homo sapiens (Human)
Description:EBI_101216
Residue:3142
BDBM53765
NameBDBM53765
Synonyms:4-({2-[5-hydroxy-3-(methylsulfanyl)-1,2,4-triazin-6-yl]anilino}methylene)-5-methyl-2-(2-naphthyl)-2,4-dihydro-3H-pyrazol-3-one 6-[2-[[(Z)-(3-methyl-1-naphthalen-2-yl-5-oxopyrazol-4-ylidene)methyl]amino]phenyl]-3-methylsulfanyl-2H-1,2,4-triazin-5-one 6-[2-[[(Z)-[5-keto-3-methyl-1-(2-naphthyl)-2-pyrazolin-4-ylidene]methyl]amino]phenyl]-3-(methylthio)-2H-1,2,4-triazin-5-one SMR000162425 | cid_5433630
TypeSmall organic molecule
Emp. Form.C25H20N6O2S
Mol. Mass.468.53
SMILESCSc1nnc(-c2ccccc2N=Cc2c(C)[nH]n(-c3ccc4ccccc4c3)c2=O)c(=O)[nH]1