Reaction Details
TargetHuntingtin
LigandBDBM95185
Substrate/Competitorn/a
IC50 1623±n/a nM
Citation PubChem, PC Fluorescence-based biochemical high throughput dose response assay to identify molecules that bind r(CAG) RNA repeats PubChem Bioassay(2013)[AID]
 
Huntingtin
Name:Huntingtin
Type:PROTEIN
Mol. Mass.:347579.69
Organism:Homo sapiens (Human)
Description:EBI_101216
Residue:3142
BDBM95185
NameBDBM95185
Synonyms:2-[[6-[(2-carbethoxyphenyl)carbamoyl]-1,2,3,4-tetrahydroacridin-9-yl]thio]acetic acid 2-[[6-[(2-ethoxycarbonylphenyl)carbamoyl]-1,2,3,4-tetrahydroacridin-9-yl]sulfanyl]acetic acid MLS000924774 cid_24789603
TypeSmall organic molecule
Emp. Form.C25H24N2O5S
Mol. Mass.464.533
SMILESCCOC(=O)c1ccccc1NC(=O)c1ccc2c(SCC(O)=O)c3CCCCc3nc2c1