Reaction Details
TargetHuntingtin
LigandBDBM96499
Substrate/Competitorn/a
IC50 451.5±n/a nM
Citation PubChem, PC Fluorescence-based biochemical high throughput dose response assay to identify molecules that bind r(CAG) RNA repeats PubChem Bioassay(2013)[AID]
 
Huntingtin
Name:Huntingtin
Type:PROTEIN
Mol. Mass.:347579.69
Organism:Homo sapiens (Human)
Description:EBI_101216
Residue:3142
BDBM96499
NameBDBM96499
Synonyms:MLS001158344 N'-[(1Z)-1-(1-cyclohexyl-2,4,6-trioxo-1,3-diazinan-5-ylidene)propyl]-2-hydroxybenzohydrazide SMR000652168 | cid_5928270
TypeSmall organic molecule
Emp. Form.C20H24N4O5
Mol. Mass.400.4284
SMILESCCC(NNC(=O)c1ccccc1O)=C1C(=O)NC(=O)N(C2CCCCC2)C1=O