Reaction Details
TargetHuntingtin
LigandBDBM61891
Substrate/Competitorn/a
IC50 987±n/a nM
Citation PubChem, PC Fluorescence-based biochemical high throughput dose response assay to identify molecules that bind r(CAG) RNA repeats PubChem Bioassay(2013)[AID]
 
Huntingtin
Name:Huntingtin
Type:PROTEIN
Mol. Mass.:347579.69
Organism:Homo sapiens (Human)
Description:EBI_101216
Residue:3142
BDBM61891
NameBDBM61891
Synonyms:1-(6-Chloro-benzothiazol-2-yl)-4-(furan-2-carbonyl)-5-furan-2-yl-3-hydroxy-1,5-dihydro-pyrrol-2-one 1-(6-chloro-1,3-benzothiazol-2-yl)-2-(2-furanyl)-3-[2-furanyl(oxo)methyl]-4-hydroxy-2H-pyrrol-5-one 1-(6-chloro-1,3-benzothiazol-2-yl)-4-(2-furoyl)-5-(2-furyl)-3-hydroxy-3-pyrrolin-2-one SMR000612211 | cid_3152768
TypeSmall organic molecule
Emp. Form.C20H11ClN2O5S
Mol. Mass.426.83
SMILESClc1ccc2nc(sc2c1)N1C(C(C(=O)c2ccco2)C(=O)C1=O)c1ccco1