Reaction Details
TargetHuntingtin
LigandBDBM96519
Substrate/Competitorn/a
IC50 1238±n/a nM
Citation PubChem, PC Fluorescence-based biochemical high throughput dose response assay to identify molecules that bind r(CAG) RNA repeats PubChem Bioassay(2013)[AID]
 
Huntingtin
Name:Huntingtin
Type:PROTEIN
Mol. Mass.:347579.69
Organism:Homo sapiens (Human)
Description:EBI_101216
Residue:3142
BDBM96519
NameBDBM96519
Synonyms:4-chloranyl-2-[2-[4-[(4-fluorophenyl)sulfonyl-methyl-amino]phenoxy]ethanoylamino]benzoic acid 4-chloro-2-[[2-[4-[(4-fluorophenyl)sulfonyl-methylamino]phenoxy]-1-oxoethyl]amino]benzoic acid MLS002252338 cid_2381372
TypeSmall organic molecule
Emp. Form.C22H18ClFN2O6S
Mol. Mass.492.905
SMILESCN(c1ccc(OCC(=O)Nc2cc(Cl)ccc2C(O)=O)cc1)S(=O)(=O)c1ccc(F)cc1