Reaction Details
TargetTrace amine-associated receptor 1
LigandBDBM31698
Substrate/Competitorn/a
EC50 826.89±n/a nM
Citation PubChem, PC Fluorescence-based cell-based high throughput dose response assay to identify agonists of the human trace amine associated receptor 1 (TAAR1) PubChem Bioassay(2013)[AID]
 
Trace amine-associated receptor 1
Name:Trace amine-associated receptor 1
Type:PROTEIN
Mol. Mass.:39107.47
Organism:Homo sapiens (Human)
Description:ChEMBL_792734
Residue:339
BDBM31698
NameBDBM31698
Synonyms:3-bromanyl-5-(3,3-dimethylpiperidin-1-yl)carbonyl-pyran-2-one 3-bromo-5-[(3,3-dimethyl-1-piperidinyl)-oxomethyl]-2-pyranone SMR000044848 | cid_664033
TypeSmall organic molecule
Emp. Form.C13H16BrNO3
Mol. Mass.314.175
SMILESCC1(C)CCCN(C1)C(=O)c1coc(=O)c(Br)c1